{"text_format":"1","workbook":"xlsx","n_sheets":4,"sheets":["Cover","Drop Down Lists","SUR Calculator","CDC Location Code"],"not_rendered":{"charts":0,"images":1,"macros":1,"external_links":0,"defined_names":17,"comments":0,"pivot_tables":0},"unopened":[],"bounds":{"document_bytes":16777216,"sheet_cells":100000,"rows_first":2000,"rows_last":500,"rows_between":2000,"halvings":0,"cell_chars":16384,"cell_head_chars":4096},"cells_cut":0,"cells_raw":0,"read":"whole","date_system":"1900"}

{"sheet":"Cover","index":0,"n_rows":20,"n_cols":1,"rows_kept":20,"cut":false,"hidden":false,"merged":[]}
["Description:"]
["Data Source: Parameters and Parameter Estimates are derived from https://www.cdc.gov/nhsn/pdfs/ps-analysis-resources/nhsn-sur-guide-508.pdf. NHSN location codes are located at: https://www.cdc.gov/nhsn/pdfs/pscmanual/15locationsdescriptions_current.pdf\n\nDisclaimer:\nColumns A through D are to be populated with drop down selections, columns E and F are to be populated with observed device days and observed patient days.\nColumns G and H are locked for editing but will display the correct Predicted Device Days and SUR values.\n\nThis calculator is intended for single location and currently does not have capabilities to apply multiple locations.\nFacility bed size and medical school affiliation should follow the most current response to the Annual Hospital Survey.\nFacility type is assumed as \"General.\""]
[]
[]
[]
[]
[]
[]
[]
[]
[]
[]
[]
[]
[]
[]
[]
[]
[]
["This material was prepared by Health Services Advisory Group (HSAG), a Hospital Quality Improvement Contractor (HQIC) under contract with the Centers for Medicare & Medicaid Services (CMS), an agency of the U.S. Department of Health and Human Services (HHS). Views expressed in this material do not necessarily reflect the official views or policy of CMS or HHS, and any reference to a specific product or entity herein does not constitute endorsement of that product or entity by CMS or HHS. Publication No. XS-HQIC-IP-10202021-01"]

{"sheet":"Drop Down Lists","index":1,"n_rows":32,"n_cols":9,"rows_kept":32,"cut":false,"hidden":true,"merged":[]}
["Hospital Type*",null,null,null,null,"Hospital Type Values*"]
["Acute Care Hospitals","Critical Access Hospitals",{"$f":"A2","v":"Acute Care Hospitals"},{"$f":"B2","v":"Critical Access Hospitals"},null,{"$f":"_xlfn.CONCAT(A2,\" \",B3)","v":"Acute Care Hospitals CLABSI"},{"$f":"_xlfn.CONCAT(B2,\" \",B3)","v":"Critical Access Hospitals CLABSI"},{"$f":"_xlfn.CONCAT(A2,\" \",C3)","v":"Acute Care Hospitals CAUTI"},{"$f":"_xlfn.CONCAT(B2,\" \",C3)","v":"Critical Access Hospitals CAUTI"}]
[{"$f":"B3","v":"CLABSI"},"CLABSI","CAUTI",{"$f":"C3","v":"CAUTI"},null,-2.8479000000000001,-2.6263000000000001,{"$f":"-3.774+1.9278","v":-1.8462000000000001},-1.8217000000000001]
["Adult Oncology Units","Antenatal, Labor, Delivery, and Postpartum Units","Adult Critical Care","Critical Care",null,1.7194,-2.9379,2.0680000000000001,1.1108]
["Antenatal, Labor, Delivery, and Postpartum Units","Critical Care Units","Behavioral Health Units","Behavioral Health Ward",null,-3.5657000000000001,0.60160000000000002,-3.0411999999999999,-2.3702000000000001]
["Behavioral Health Units ","Nursery and Pediatric Units","Burn and Cardiac Critical Care","Referent Units",null,-3.3721000000000001,-1.0764,1.5991,0]
["Chronic Care","Referent Units","Chronic Care",null,null,0.3952,0,0.51880000000000004]
["Critical Care Units",null,"Higher Device Use Oncology Wards",null,null,1.6404000000000001,null,0.56799999999999995]
["Oncology Step-down Unit",null,"Higher Device Use Specialty Wards ",null,null,1.0474000000000001,null,0.31309999999999999]
["Other Pediatric Units",null,"Lower Device Use Oncology Wards",null,null,-0.73480000000000001,null,-0.32429999999999998]
["Other Units ",null,"Lower Device Use Specialty Wards",null,null,-0.8357,null,-0.22600000000000001]
["Pediatric Critical Care Units",null,"Mixed Acuity Units ",null,null,0.88549999999999995,null,0.373]
["Pediatric Oncology Units",null,"Nurseries",null,null,2.1583999999999999,null,-3.9285999999999999]
["Referent Units",null,"Pediatric Critical Care",null,null,0,null,0.1016]
["Specialty Care Areas",null,"Pediatric Medical Critical Care",null,null,1.0954999999999999,null,-0.58530000000000004]
["Specialty Care Units",null,"Pediatric Orthopedic Ward",null,null,-0.41839999999999999,null,0.73009999999999997]
["Step-down Neonatal Nursery Level II",null,"Pediatric Wards",null,null,-1.7706999999999999,null,-1.8640000000000001]
["Ventilator Dependent Unit",null,"Referent Units",null,null,1.1229,null,0]
["Well Baby Nursery",null,"Rehabilitation Units",null,null,-4.4135999999999997,null,-0.56720000000000004]
[null,null,"Specialty Critical Care Units",null,null,null,null,0.97389999999999999]
[null,null,"Step Ward",null,null,null,null,0.49909999999999999]
[]
["Facility Size",null,null,null,null,"Facility Size"]
["≤ 62 beds ","≤ 62 beds ","< 62 beds","< 62 beds",null,0,0,0,0]
["63- 140 beds ","63- 140 beds ","62-139 beds","62-139 beds",null,0.5847,0,0.10589999999999999,0]
["141- 267 beds","141- 267 beds","≥ 140 beds","≥ 140 beds",null,0.96950000000000003,0,0.29060000000000002,0]
["≥ 268 beds","≥ 268 beds",null,null,null,1.2412000000000001,0]
[]
["Teaching Status",null,null,null,null,"Teaching Status"]
["Major","Major","Major","Major",null,0.14910000000000001,0,-0.14119999999999999,0]
["Non-Major","Non-Major","Non-Major","Non-Major",null,0,0,0,0]
["*https://www.cdc.gov/nhsn/pdfs/ps-analysis-resources/nhsn-sur-guide-508.pdf#:~:text=The%20SUR%20is%20calculated%20by%20dividing%20the%20number,this%20document%20for%20more%20details%20regarding%20the%20models"]

{"sheet":"SUR Calculator","index":2,"n_rows":8,"n_cols":9,"rows_kept":8,"cut":false,"hidden":false,"merged":[]}
["Hospital Type","Measure Type","Unit Type (CDC Location Code)*","Facility Size","Teaching Status","Observed Device Days","Observed Patient Days","Predicted Device Days","SUR"]
[null,null,null,null,null,null,null,{"$f":"_xlfn.IFNA($G$2*\nEXP(\nINDEX('Drop Down Lists'!F3:I3,MATCH(_xlfn.CONCAT('SUR Calculator'!A2,\" \",'SUR Calculator'!B2),'Drop Down Lists'!F2:I2,0))\n+_xlfn.IFS(\n_xlfn.CONCAT($A$2,\" \",$B$2)=A1_1,\nINDEX('Drop Down Lists'!$F$4:$F$19,MATCH($C$2,Acute_Care_Hospitals_CLABSI,0))+\nINDEX('Drop Down Lists'!$F$24:$F$27,MATCH($D$2,Acute_Care_Hospitals_CLABSI2,0))+\nINDEX('Drop Down Lists'!$F$30:$F$31,MATCH($E$2,Acute_Care_Hospitals_CLABSI3,0)),\n_xlfn.CONCAT($A$2,\" \",$B$2)=A1_2,\nINDEX('Drop Down Lists'!$G$4:$G$7,MATCH($C$2,Critical_Access_Hospitals_CLABSI,0))+\nINDEX('Drop Down Lists'!$G$24:$G$26,MATCH($D$2,Critical_Access_Hospitals_CLABSI2,0))+\nINDEX('Drop Down Lists'!$G$30:$G$31,MATCH($E$2,Critical_Access_Hospitals_CLABSI3,0)),\n_xlfn.CONCAT($A$2,\" \",$B$2)=A1_3,\nINDEX('Drop Down Lists'!$H$4:$H$21,MATCH($C$2,Acute_Care_Hospitals_CAUTI,0))+\nINDEX('Drop Down Lists'!$H$24:$H$26,MATCH($D$2,Acute_Care_Hospitals_CAUTI2,0))+\nINDEX('Drop Down Lists'!$H$30:$H$31,MATCH($E$2,Acute_Care_Hospitals_CAUTI3,0)),\n_xlfn.CONCAT($A$2,\" \",$B$2)=A1_4,\nINDEX('Drop Down Lists'!$I$4:$I$6,MATCH($C$2,Critical_Access_Hospitals_CAUTI,0))+\nINDEX('Drop Down Lists'!$I$24:$I$26,MATCH($D$2,Critical_Access_Hospitals_CAUTI2,0))+\nINDEX('Drop Down Lists'!$I$30:$I$31,MATCH($E$2,Critical_Access_Hospitals_CAUTI3,0))))/\n(1+EXP(\nINDEX('Drop Down Lists'!F3:I3,MATCH(_xlfn.CONCAT('SUR Calculator'!A2,\" \",'SUR Calculator'!B2),'Drop Down Lists'!F2:I2,0))\n+_xlfn.IFS(\n_xlfn.CONCAT($A$2,\" \",$B$2)=A1_1,\nINDEX('Drop Down Lists'!$F$4:$F$19,MATCH($C$2,Acute_Care_Hospitals_CLABSI,0))+\nINDEX('Drop Down Lists'!$F$24:$F$27,MATCH($D$2,Acute_Care_Hospitals_CLABSI2,0))+\nINDEX('Drop Down Lists'!$F$30:$F$31,MATCH($E$2,Acute_Care_Hospitals_CLABSI3,0)),\n_xlfn.CONCAT($A$2,\" \",$B$2)=A1_2,\nINDEX('Drop Down Lists'!$G$4:$G$7,MATCH($C$2,Critical_Access_Hospitals_CLABSI,0))+\nINDEX('Drop Down Lists'!$G$24:$G$26,MATCH($D$2,Critical_Access_Hospitals_CLABSI2,0))+\nINDEX('Drop Down Lists'!$G$30:$G$31,MATCH($E$2,Critical_Access_Hospitals_CLABSI3,0)),\n_xlfn.CONCAT($A$2,\" \",$B$2)=A1_3,\nINDEX('Drop Down Lists'!$H$4:$H$21,MATCH($C$2,Acute_Care_Hospitals_CAUTI,0))+\nINDEX('Drop Down Lists'!$H$24:$H$26,MATCH($D$2,Acute_Care_Hospitals_CAUTI2,0))+\nINDEX('Drop Down Lists'!$H$30:$H$31,MATCH($E$2,Acute_Care_Hospitals_CAUTI3,0)),\n_xlfn.CONCAT($A$2,\" \",$B$2)=A1_4,\nINDEX('Drop Down Lists'!$I$4:$I$6,MATCH($C$2,Critical_Access_Hospitals_CAUTI,0))+\nINDEX('Drop Down Lists'!$I$24:$I$26,MATCH($D$2,Critical_Access_Hospitals_CAUTI2,0))+\nINDEX('Drop Down Lists'!$I$30:$I$31,MATCH($E$2,Critical_Access_Hospitals_CAUTI3,0))))),\"\")","v":""},{"$f":"IFERROR(F2/H2,\"\")","v":""}]
["*Reference 'CDC Location Code' sheet for a breakout of CDC Location Code"]
[]
[]
[]
[null,"Hospital/Measure","Unit Type","Facity Size","Teaching Status","logit(P_Hat)","P_Hat","Predicted Device Days","SUR"]
[null,{"$f":"INDEX('Drop Down Lists'!F3:I3,MATCH(_xlfn.CONCAT('SUR Calculator'!A2,\" \",'SUR Calculator'!B2),'Drop Down Lists'!F2:I2,0))","v":{"$error":"#N/A"}},{"$f":"_xlfn.IFS(_xlfn.CONCAT($A$2,\" \",$B$2)=A1_1,INDEX('Drop Down Lists'!$F$4:$F$19,MATCH($C$2,Acute_Care_Hospitals_CLABSI,0)),_xlfn.CONCAT($A$2,\" \",$B$2)=A1_2,INDEX('Drop Down Lists'!$G$4:$G$7,MATCH($C$2,Critical_Access_Hospitals_CLABSI,0)),_xlfn.CONCAT($A$2,\" \",$B$2)=A1_3,INDEX('Drop Down Lists'!$H$4:$H$21,MATCH($C$2,Acute_Care_Hospitals_CAUTI,0)),_xlfn.CONCAT($A$2,\" \",$B$2)=A1_4,INDEX('Drop Down Lists'!$I$4:$I$6,MATCH($C$2,Critical_Access_Hospitals_CAUTI,0)))","v":{"$error":"#N/A"}},{"$f":"_xlfn.IFS(_xlfn.CONCAT($A$2,\" \",$B$2)=A1_1,INDEX('Drop Down Lists'!$F$24:$F$27,MATCH($D$2,Acute_Care_Hospitals_CLABSI2,0)),_xlfn.CONCAT($A$2,\" \",$B$2)=A1_2,INDEX('Drop Down Lists'!$G$24:$G$26,MATCH($D$2,Critical_Access_Hospitals_CLABSI2,0)),_xlfn.CONCAT($A$2,\" \",$B$2)=A1_3,INDEX('Drop Down Lists'!$H$24:$H$26,MATCH($D$2,Acute_Care_Hospitals_CAUTI2,0)),_xlfn.CONCAT($A$2,\" \",$B$2)=A1_4,INDEX('Drop Down Lists'!$I$24:$I$26,MATCH($D$2,Critical_Access_Hospitals_CAUTI2,0)))","v":{"$error":"#N/A"}},{"$f":"_xlfn.IFS(_xlfn.CONCAT($A$2,\" \",$B$2)=A1_1,INDEX('Drop Down Lists'!$F$30:$F$31,MATCH($E$2,Acute_Care_Hospitals_CLABSI3,0)),_xlfn.CONCAT($A$2,\" \",$B$2)=A1_2,INDEX('Drop Down Lists'!$G$30:G$31,MATCH($E$2,Critical_Access_Hospitals_CLABSI3,0)),_xlfn.CONCAT($A$2,\" \",$B$2)=A1_3,INDEX('Drop Down Lists'!$H$30:$H$31,MATCH($E$2,Acute_Care_Hospitals_CAUTI3,0)),_xlfn.CONCAT($A$2,\" \",$B$2)=A1_4,INDEX('Drop Down Lists'!$I$30:$I$31,MATCH($E$2,Critical_Access_Hospitals_CAUTI3,0)))","v":{"$error":"#N/A"}},{"$f":"SUM(B8:E8)+1.9278","v":{"$error":"#N/A"}},{"$f":"EXP(F8)/(1+EXP(F8))","v":{"$error":"#N/A"}},{"$f":"G8*G2","v":{"$error":"#N/A"}},{"$f":"F2/H8","v":{"$error":"#N/A"}}]

{"sheet":"CDC Location Code","index":3,"n_rows":242,"n_cols":2,"rows_kept":242,"cut":false,"hidden":false,"merged":[]}
["Acute Care Hospitals CLABSI"]
["CDC Location Name: Critical Care Units","CDC Location Code: Critical Care Units"]
["Burn Critical Care","IN:ACUTE:CC:B"]
["Medical Cardiac Critical Care","IN:ACUTE:CC:C"]
["Surgical Cardiothoracic Critical Care","IN:ACUTE:CC:CT"]
["Medical Critical Care","IN:ACUTE:CC:M"]
["Medical Surgical Critical Care","IN:ACUTE:CC:MS"]
["Neurology Critical Care","IN:ACUTE:CC:N"]
["Neurosurgical Critical Care","IN:ACUTE:CC:NS"]
["Oncology Medical Critical Care","IN:ACUTE:CC:ONC_M"]
["Oncology Medical Surgical Critical Care","IN:ACUTE:CC:ONC_MS"]
["Pediatric Oncology Critical Care","IN:ACUTE:CC:ONC_PED"]
["Oncology Surgical Critical Care","IN:ACUTE:CC:ONC_S"]
["Prenatal Critical Care","IN:ACUTE:CC:PNATL"]
["Respiratory Critical Care","IN:ACUTE:CC:R"]
["Surgical Critical Care","IN:ACUTE:CC:S"]
["Trauma Critical Care","IN:ACUTE:CC:T "]
["CDC Location Name: Pediatric Critical Care Units","CDC Location Code: Pediatric Critical Care Units"]
["Pediatric Burn Critical Care","IN:ACUTE:CC:B_PED"]
["Pediatric Cardiothoracic Critical Care","IN:ACUTE:CC:CT_PED"]
["Pediatric Medical Surgical Critical Care","IN:ACUTE:CC:MS_PED"]
["Pediatric Medical Critical Care","IN:ACUTE:CC:M_PED"]
["Pediatric Neurosurgical Critical Care","IN:ACUTE:CC:NS_PED"]
["Pediatric Surgical Critical Care","IN:ACUTE:CC:S_PED"]
["Pediatric Trauma Critical Care","IN:ACUTE:CC:T_PED"]
["CDC Location Name: Specialty Care Areas","CDC Location Code: Specialty Care Areas"]
["Inpatient Dialysis","IN:ACUTE:SCA:DIAL"]
["Solid Organ Transplant (adult)","IN:ACUTE:SCA:SOTP"]
["Solid Organ Transplant (pediatric)","IN:ACUTE:SCA:SOTP_PED"]
["CDC Location Code: Step-down Neonatal Nursery Level II","IN:ACUTE:STEP:NURS"]
["CDC Location Code: Oncology Step-down Unit","IN:ACUTE:STEP:ONC"]
["CDC Location Code: Well Baby Nursery","IN:ACUTE:WARD:NURS"]
["CDC Location Code: Ventilator Dependent Unit","IN:NONACUTE:LTC:R"]
["CDC Location Name: Behavioral Health Units","CDC Location Code: Behavioral Health Units"]
["Behavioral Health Ward","IN:ACUTE:WARD:BHV"]
["Adolescent Behavioral Health Ward","IN:ACUTE:WARD: BHV_ADOL"]
["Pediatric Behavioral Ward","IN:ACUTE:WARD:BHV_PED"]
["CDC Location Name: Chronic Care","CDC Location Code: Chronic Care"]
["Chronic Care Unit","IN:NONACUTE:LTC"]
["Chronic Behavioral Health Unit","IN:NONACUTE:LTC:BHV "]
["Inpatient Hospice","IN:NONACUTE:LTC:HSP"]
["Chronic Rehabilitation Unit","IN:NONACUTE:LTC:REHAB "]
["CDC Location Name: Antenatal, Labor, Delivery, and Postpartum Units","CDC Location Code: Antenatal, Labor, Delivery, and Postpartum Units"]
["Antenatal Care Ward","IN:ACUTE:WARD:ANTENAT"]
["Labor and Delivery Ward","IN:ACUTE:WARD:LD "]
["Labor, Delivery, Recovery, Postpartum Suite (LDRP)","IN:ACUTE:WARD:LD_PP"]
["Postpartum Ward","IN:ACUTE:WARD:PP"]
["CDC Location Name: Adult Oncology Units","CDC Location Code: Adult Oncology Units"]
["General Hematology Oncology Ward","IN:ACUTE:WARD: ONC_HONC"]
["Bone Marrow Transplant Unit","IN:ACUTE:SCA:BMT"]
["Leukemia Ward Leukemia and Lymphoma Ward","IN:ACUTE:WARD: ONC_LL"]
["Lymphoma Ward","IN:ACUTE:WARD:ONC_LYMPH"]
["CDC Location Name: Pediatric Oncology Units","CDC Location Code: Pediatric Oncology Units"]
["General Pediatric Hematology Oncology Ward","IN:ACUTE:WARD:ONC_HONC_PED"]
["Pediatric Bone Marrow Transplant Unit","IN:ACUTE:SCA:BMT_PED"]
["CDC Location Name: Other Units","CDC Location Code: Other Units"]
["Pediatric Mixed Acuity Unit","IN:ACUTE:MIXED:ALL_PEDS"]
["Ear, Nose, and Throat Ward","IN:ACUTE:WARD:ENT"]
["Gynecological Ward","IN:ACUTE:WARD:GYN"]
["Pediatric Medical Ward","IN:ACUTE:WARD:M_PED"]
["Ophthalmology Ward","IN:ACUTE:WARD:OPH"]
["Orthopedic Ward","IN:ACUTE:WARD:ORT "]
["Pediatric Orthopedic Ward","IN:ACUTE:WARD:ORT_PED"]
["Plastic Surgery Ward","IN:ACUTE:WARD:PLS"]
["Pediatric Rehabilitation Ward","IN:ACUTE:WARD:REHAB_PED"]
["CDC Location Name: Other Pediatric Units","CDC Location Code: Other Pediatric Units"]
["Pediatric Burn Ward","IN:ACUTE:WARD:B_PED"]
["Pediatric Medical Surgical Ward","IN:ACUTE:WARD:MS_PED"]
["Pediatric Neurosurgical Ward","IN:ACUTE:WARD:NS_PED"]
["Pediatric Neurology Ward","IN:ACUTE:WARD:N_PED"]
["Pediatric Surgical Ward","IN:ACUTE:WARD:S_PED"]
["CDC Location Name: Specialty Care Units","CDC Location Code: Specialty Care Units"]
["Gerontology Ward","IN:ACUTE:WARD:GNT"]
["Neurology Ward","IN:ACUTE:WARD:N "]
["Neurosurgical Ward","IN:ACUTE:WARD:NS"]
["Stroke Ward","IN:ACUTE:WARD:STRK"]
["Orthopedic Trauma Ward","IN:ACUTE:WARD:T_ORT"]
["CDC Location Name: Referent Units","CDC Location Code: Referent Units"]
["All Ages Mixed Acuity Unit","IN:ACUTE:MIXED:ALL"]
["Adult Mixed Acuity Unit","IN:ACUTE:MIXED:ALL_ADULT"]
["All Ages Oncology Mixed Acuity Unit","IN: ACUTE:MIXED:ONC"]
["Step Ward","IN:ACUTE:STEP"]
["Pediatric Step Ward","IN:ACUTE:STEP:PED"]
["Burn Ward","IN:ACUTE:WARD:B"]
["Gastrointestinal Ward","IN:ACUTE:WARD:GI"]
["Genitourinary Ward","IN:ACUTE:WARD:GU"]
["Jail Unit","IN:ACUTE:WARD:JAL"]
["Medical Ward","IN:ACUTE:WARD:M"]
["Medical Surgical Ward","IN:ACUTE:WARD:MS"]
["Solid Tumor Ward","IN:ACUTE:WARD:ONC_ST"]
["Pulmonary Ward","IN:ACUTE:WARD:PULM"]
["Rehabilitation Ward","IN:ACUTE:WARD:REHAB"]
["Surgical Ward","IN:ACUTE:WARD:S"]
["Telemetry Ward","IN:ACUTE:WARD:TEL"]
["Vascular Surgery Ward","IN:ACUTE:WARD:VS"]
[]
["Critical Access Hospitals CLABSI"]
["CDC Location Name: Critical Care Units","CDC Location Code: Critical Care Units"]
["Medical Cardiac Critical Care","IN:ACUTE:CC:C"]
["Medical Critical Care","IN:ACUTE:CC:M"]
["Medical Surgical Critical Care","IN:ACUTE:CC:MS"]
["CDC Location Name: Antenatal, Labor, Delivery, and Postpartum Units","CDC Location Code: Antenatal, Labor, Delivery, and Postpartum Units"]
["Labor and Delivery Ward","IN:ACUTE:WARD:LD"]
["Labor, Delivery, Recovery, Postpartum Suite (LDRP)","IN:ACUTE:WARD:LD_PP"]
["Postpartum Ward","IN:ACUTE:WARD:PP "]
["CDC Location Name: Nursery and Pediatric Units","CDC Location Code: Nursery and Pediatric Units"]
["Pediatric Medical Surgical Ward","IN:ACUTE:WARD:MS_PED"]
["Well Baby Nursery","IN:ACUTE:WARD:NURS "]
["CDC Location Name: Referent Units","CDC Location Code: Referent Units"]
["All Ages Mixed Acuity Unit","IN:ACUTE:MIXED:ALL"]
["Step Ward","IN:ACUTE:STEP"]
["Behavioral Health Ward","IN:ACUTE:WARD:BHV"]
["Jail Unit","IN:ACUTE:WARD:JAL"]
["Medical Ward","IN:ACUTE:WARD:M"]
["Medical Surgical Ward","IN:ACUTE:WARD:MS"]
["Orthopedic Ward","IN:ACUTE:WARD:ORT"]
["Rehabilitation Ward","IN:ACUTE:WARD:REHAB"]
["Surgical Ward","N:ACUTE:WARD:S"]
["Telemetry Ward","IN:ACUTE:WARD:TEL"]
["Chronic Care Unit","IN:NONACUTE:LTC"]
[]
["Acute Care Hospitals CAUTI"]
["CDC Location Name: Adult Critical Care","CDC Location Code: Adult Critical Care"]
["Surgical Cardiothoracic Critical Care","IN:ACUTE:CC:CT"]
["Medical Critical Care","IN:ACUTE:CC:M "]
["Medical Surgical Critical Care","IN:ACUTE:CC:MS"]
["Neurology Critical Care","IN:ACUTE:CC:N"]
["Neurosurgical Critical Care","IN:ACUTE:CC:NS"]
["Oncology Medical Critical Care","IN:ACUTE:CC:ONC_M"]
["Pediatric Oncology Critical Care","IN:ACUTE:CC:ONC_PED"]
["Oncology Surgical Critical Care","IN:ACUTE:CC:ONC_S"]
["Surgical Critical Care","IN:ACUTE:CC:S"]
["Trauma Critical Care","IN:ACUTE:CC:T"]
["CDC Location Name: Pediatric Critical Care","CDC Location Code: Pediatric Critical Care"]
["Pediatric Burn Critical Care","IN:ACUTE:CC:B_PED"]
["Pediatric Surgical Cardiothoracic Critical Care","IN:ACUTE:CC:CT_PED"]
["Pediatric Medical Surgical Critical Care","IN:ACUTE:CC:MS_PED"]
["Pediatric Neurosurgical Critical Care","IN:ACUTE:CC:NS_PED"]
["Pediatric Surgical Care","IN:ACUTE:CC:S_PED"]
["Pediatric Trauma Critical Care","IN:ACUTE:CC:T_PED"]
["CDC Location Name: Burn and Cardiac Critical Care","CDC Location Code: Burn and Cardiac Critical Care"]
["Burn Critical Care","IN:ACUTE:CC:B"]
["Cardiac Critical Care","IN:ACUTE:CC:C"]
["CDC Location Code: Pediatric Medical Critical Care","IN:ACUTE:CC:M_PED"]
["CDC Location Name: Specialty Critical Care Units","CDC Location Code: Specialty Critical Care Units"]
["Prenatal Critical Care","IN:ACUTE:CC:PNATL"]
["Respiratory Critical Care","IN:ACUTE:CC:R"]
["CDC Location Code: Step Ward","IN:ACUTE:STEP"]
["CDC Location Code: Pediatric Orthopedic Ward","IN:ACUTE:WARD:ORT_PED"]
["CDC Location Name: Chronic Care","CDC Location Code: Chronic Care"]
["Chronic Care Unit","IN:NONACUTE:LTC"]
["Inpatient Hospice","IN:NONACUTE:LTC:HSP"]
["Ventilator Dependent Unit","IN:NONACUTE:LTC:R"]
["CDC Location Name: Behavioral Health Units","CDC Location Code: Behavioral Health Units"]
["Behavioral Health Ward","IN:ACUTE:WARD:BHV"]
["Adolescent Behavioral Health Ward","IN:ACUTE:WARD:BHV_ADOL "]
["Pediatric Behavioral Health Ward","IN:ACUTE:WARD:BHV_PED"]
["Chronic Behavioral Health Unit","IN:NONACUTE:LTC:BHV"]
["CDC Location Name: Mixed Acuity Units","CDC Location Code: Mixed Acuity Units"]
["All Ages Mixed Acuity Unit","IN:ACUTE:MIXED:ALL"]
["Adult Mixed Acuity Unit","IN:ACUTE:MIXED:ALL_ADULT"]
["Oncology Mixed Acuity Unit","IN:ACUTE:MIXED:ONC"]
["CDC Location Name: Nurseries","CDC Location Code: Nurseries"]
["Step down Neonatal Nursery","IN:ACUTE:STEP:NURS"]
["Well Baby Nursery","IN:ACUTE:WARD:NURS"]
["CDC Location Name: Rehabilitation Units","CDC Location Code: Rehabilitation Units"]
["Rehabilitation Ward","IN:ACUTE:WARD:REHAB"]
["Chronic Rehabilitation Unit","IN:NONACUTE:LTC:REHAB "]
["CDC Location Name: Higher Device Use Specialty Wards","CDC Location Code: Higher Device Use Specialty Wards"]
["Burn Ward","IN:ACUTE:WARD:B"]
["Gastrointestinal Ward","IN:ACUTE:WARD:GI"]
["Genitourinary Ward","IN:ACUTE:WARD:GU"]
["Gynecology Ward","IN:ACUTE:WARD:GYN"]
["Labor and Delivery Ward","IN:ACUTE:WARD:LD"]
["Neurosurgical Ward","IN:ACUTE:WARD:NS"]
["Orthopedic Ward","IN:ACUTE:WARD:ORT"]
["Pulmonary Ward","IN:ACUTE:WARD:PULM"]
["Surgical Ward","IN:ACUTE:WARD:S"]
["CDC Location Name: Lower Device Use Specialty Wards","CDC Location Code: Lower Device Use Specialty Wards"]
["Antenatal Ward","IN:ACUTE:WARD:ANTENAT"]
["Ear, Nose, and Throat Ward","IN:ACUTE:WARD:ENT"]
["Gerontology Ward","IN:ACUTE:WARD:GNT"]
["Jail Unit","IN:ACUTE:WARD:JAL"]
["Labor, Delivery, and Postpartum Ward","IN:ACUTE:WARD:LD_PP"]
["Medical Ward","IN:ACUTE:WARD:M"]
["Ophthalmology Ward","IN:ACUTE:WARD:OPH"]
["Plastic Surgery Ward","IN:ACUTE:WARD:PLS"]
["Postpartum Ward","IN:ACUTE:WARD:PP"]
["CDC Location Name: Higher Device Use Oncology Wards","CDC Location Code: Higher Device Use Oncology Wards"]
["Oncology Step Down Unit","IN:ACUTE:STEP:ONC"]
["Solid Tumor Ward","IN:ACUTE:WARD:ONC_ST"]
["CDC Location Name: Lower Device Use Oncology Wards","CDC Location Code: Lower Device Use Oncology Wards"]
["General Hematology Oncology Ward","IN:ACUTE:WARD: ONC_HONC"]
["Hematopoietic Stem Cell Transplant Ward","IN:ACUTE:WARD: ONC_HSCT"]
["Leukemia Ward","IN:ACUTE:WARD: ONC_LEUK"]
["Leukemia Lymphoma Ward","IN:ACUTE:WARD: ONC_LL"]
["Lymphoma Ward","IN:ACUTE:WARD:ONC_LYMPH "]
["CDC Location Name: Pediatric Wards","CDC Location Code: Pediatric Wards"]
["Pediatric Mixed Acuity Unit","IN:ACUTE:MIXED:ALL_PEDS"]
["Pediatric Step Down Unit","IN:ACUTE:STEP:PED"]
["Pediatric Burn Ward","IN:ACUTE:WARD:B_PED"]
["Pediatric Medical Surgical Ward","IN:ACUTE:WARD:MS_PED"]
["Pediatric Medical Ward","IN:ACUTE:WARD:M_PED"]
["Pediatric Neurosurgical Ward","IN:ACUTE:WARD:NS_PED"]
["Pediatric Neurology Ward","IN:ACUTE:WARD:N_PED"]
["Pediatric General Hematology Oncology Ward","IN:ACUTE:WARD:ONC_HONC_PED"]
["Pediatric Hematopoietic Stem Cell Transplant Ward","IN:ACUTE:WARD:ONC_HSCT_PED"]
["Pediatric Rehabilitation Ward","IN:ACUTE:WARD:REHAB_PED"]
["Pediatric Surgical Ward","IN:ACUTE:WARD:S_PED"]
["CDC Location Name: Referent Units","CDC Location Code: Referent Units"]
["Dialysis Specialty Care Unit","IN:ACUTE:SCA:DIAL"]
["Solid Organ Transplant Specialty Care Unit","IN:ACUTE:SCA:SOTP"]
["Medical Surgical Ward","IN:ACUTE:WARD:MS"]
["Neurology Ward","IN:ACUTE:WARD:N"]
["Stroke Unit","IN:ACUTE:WARD:STRK"]
["Telemetry Ward","IN:ACUTE:WARD:TEL"]
["Trauma Orthopedic Ward","IN:ACUTE:WARD:T_ORT"]
["Vascular Surgery Ward","IN:ACUTE:WARD:VS"]
[]
["Critical Access Hospitals CAUTI"]
["CDC Location Name: Critical Care","CDC Location Code: Critical Care"]
["Cardiac Critical Care Unit","IN:ACUTE:CC:C"]
["Medical Critical Care Unit","IN:ACUTE:CC:M"]
["Medical Surgical Critical Care Unit","IN:ACUTE:CC:MS"]
["CDC Location Code: Behavioral Health Ward","IN:ACUTE:WARD:BHV"]
["CDC Location Name: Referent Units","CDC Location Code: Referent Units"]
["All Ages Mixed Acuity Unit","IN:ACUTE:MIXED:ALL"]
["Adult Mixed Acuity Unit","IN:ACUTE:MIXED:ALL_ADULT"]
["Step Down Unit","IN:ACUTE:STEP"]
["Jail Unit","IN:ACUTE:WARD:JAL "]
["Labor and Delivery Ward","IN:ACUTE:WARD:LD "]
["Labor, Delivery, and Postpartum Ward","IN:ACUTE:WARD:LD_PP"]
["Medical Ward","IN:ACUTE:WARD:M "]
["Medical Surgical Ward","IN:ACUTE:WARD:MS "]
["Pediatric Medical Surgical Ward","IN:ACUTE:WARD:MS_PED"]
["Well Baby Nursery","IN:ACUTE:WARD:NURS"]
["Orthopedic Ward","IN:ACUTE:WARD:ORT"]
["Postpartum Ward","IN:ACUTE:WARD:PP"]
["Rehabilitation Ward","IN:ACUTE:WARD:REHAB"]
["Surgical Ward","IN:ACUTE:WARD:S"]
["Telemetry Ward","IN:ACUTE:WARD:TEL"]
["Chronic Care unit","IN:NONACUTE:LTC"]